Target
Rod cGMP-specific 3',5'-cyclic phosphodiesterase subunit alpha
Ligand
BDBM50300984
Substrate
Meas. Tech.
ChEMBL_597960 (CHEMBL1042745)
IC50
99±n/a nM
Citation
 Hughes, ROWalker, JKRogier, DJHeasley, SEBlevis-Bal, RMBenson, AGJacobsen, EJCubbage, JWFobian, YMOwen, DRFreskos, JNMolyneaux, JMBrown, DLAcker, BAMaddux, TMTollefson, MBMoon, JBMischke, BVRumsey, JMZheng, YMacInnes, ABond, BRYu, Y Optimization of the aminopyridopyrazinones class of PDE5 inhibitors: discovery of 3-[(trans-4-hydroxycyclohexyl)amino]-7-(6-methoxypyridin-3-yl)-1-(2-propoxyethyl)pyrido[3,4-b]pyrazin-2(1H)-one. Bioorg Med Chem Lett 19:5209-13 (2009)  
Target
Name:
Rod cGMP-specific 3',5'-cyclic phosphodiesterase subunit alpha
Synonyms:
PDE6A PDEA | Rod cGMP-specific 3',5'-cyclic phosphodiesterase alpha
Type:
PROTEIN
Mol. Mass.:
99531.10
Organism:
Homo sapiens (Human)
Description:
ChEMBL_1347866
Residue:
860
  
Inhibitor
Name:
BDBM50300984
Synonyms:
3-(2-(4-ethylpiperazin-1-yl)-2-oxoethylamino)-7-(6-methoxypyridin-3-yl)-1-(2-propoxyethyl)pyrido[2,3-b]pyrazin-2(1H)-one | CHEMBL579669
Type:
Small organic molecule
Emp. Form.:
C26H35N7O4
Mol. Mass.:
509.6006
SMILES:
CCCOCCn1c2cc(cnc2nc(NCC(=O)N2CCN(CC)CC2)c1=O)-c1ccc(OC)nc1
: