Target
Cannabinoid receptor 1
Ligand
BDBM50200841
Substrate
Meas. Tech.
ChEMBL_598162 (CHEMBL1044346)
EC50
2.4±n/a nM
Citation
 Du, WJewell, JPLin, LSColandrea, VJXiao, JCLao, JShen, CPBateman, TJReddy, VBHa, SNShah, SKFong, TMHale, JJHagmann, WK Synthesis and evaluation of N-[(1S,2S)-3-(4-chlorophenyl)-2-(3-cyanophenyl)-1-methylpropyl]-2-methyl-2-aminopropanamide as human cannabinoid-1 receptor (CB1R) inverse agonists. Bioorg Med Chem Lett 19:5195-9 (2009)  
Target
Name:
Cannabinoid receptor 1
Synonyms:
CANN6 CB-R CNR CNR1_HUMAN Cannabinoid receptor Cannabinoid receptor 1 (brain)
Type:
G Protein-Coupled Receptor (GPCR)
Mol. Mass.:
52868.96
Organism:
Homo sapiens (Human)
Description:
P21554
Residue:
472
  
Inhibitor
Name:
BDBM50200841
Synonyms:
CHEMBL220360 MK-0634 N-[(1S,2S)-3-(4-chlorophenyl)-2-(3-cyanophenyl)-1-methylpropyl]-2-methyl-2-{[5-(trifluoromethyl)pyridin-2-yl]oxy}propanamide Taranbant
Type:
Small organic molecule
Emp. Form.:
C27H25ClF3N3O2
Mol. Mass.:
515.955
SMILES:
C[C@H](NC(=O)C(C)(C)Oc1ccc(cn1)C(F)(F)F)[C@@H](Cc1ccc(Cl)cc1)c1cccc(c1)C#N
: