Target
Stearoyl-CoA desaturase
Ligand
BDBM50301058
Substrate
Meas. Tech.
ChEMBL_598345 (CHEMBL1050577)
IC50
13000±n/a nM
Citation
 Li, CSBelair, LGuay, JMurgasva, RSturkenboom, WRamtohul, YKZhang, LHuang, Z Thiazole analog as stearoyl-CoA desaturase 1 inhibitor. Bioorg Med Chem Lett 19:5214-7 (2009)  
Target
Name:
Stearoyl-CoA desaturase
Synonyms:
Acyl-CoA desaturase SCD SCDOS Stearoyl-CoA (SCD1) | Stearoyl-CoA desaturase 1
Type:
Enzyme
Mol. Mass.:
41537.27
Organism:
Homo sapiens (Human)
Description:
O00767
Residue:
359
  
Inhibitor
Name:
BDBM50301058
Synonyms:
(4-(thiazol-2-yl)piperazin-1-yl)(2-(trifluoromethyl)phenyl)methanone | CHEMBL566052
Type:
Small organic molecule
Emp. Form.:
C15H14F3N3OS
Mol. Mass.:
341.351
SMILES:
FC(F)(F)c1ccccc1C(=O)N1CCN(CC1)c1nccs1
: