Target
Beta-2 adrenergic receptor
Ligand
BDBM50151720
Substrate
Meas. Tech.
ChEMBL_599080 (CHEMBL1044606)
EC50
0.400000±n/a nM
Citation
 Bouyssou, TRudolf, KHoenke, CLustenberger, PSchnapp, AKonetzki, I Studies towards topical selective beta2-adrenoceptor agonists with a long duration of action. Bioorg Med Chem Lett 19:5237-40 (2009)  
Target
Name:
Beta-2 adrenergic receptor
Synonyms:
ADRB2 ADRB2_HUMAN Beta-2 adrenoceptor | Beta-2 adrenoreceptor
Type:
Mol. Mass.:
46461.69
Organism:
Homo sapiens (Human)
Description:
P07550
Residue:
413
  
Inhibitor
Name:
BDBM50151720
Synonyms:
ARFORMOTEROL TARTRATE CHEMBL605993 FORMOTEROL FUMARATE N-(2-Hydroxy-5-{1-hydroxy-2-[2-(4-methoxy-phenyl)-1-methyl-ethylamino]-ethyl}-phenyl)-formamide Symbicort | cid_9912089
Type:
Small organic molecule
Emp. Form.:
C19H24N2O4
Mol. Mass.:
344.4049
SMILES:
COc1ccc(C[C@@H](C)NC[C@H](O)c2ccc(O)c(NC=O)c2)cc1
: