Target
5-hydroxytryptamine receptor 2A
Ligand
BDBM50301476
Substrate
Meas. Tech.
ChEMBL_600346 (CHEMBL1041064)
Ki
0.22±n/a nM
Citation
 Dosa, PIStrah-Pleynet, SJayakumar, HCasper, MDecaire, MXiong, YLehmann, JChoi, KElwell, KWong, AWebb, RRAdams, JWRamirez, JRichman, JGThomsen, WSemple, GTeegarden, BR Solubilized phenyl-pyrazole ureas as potent, selective 5-HT(2A) inverse-agonists and their application as antiplatelet agents. Bioorg Med Chem Lett 19:5486-9 (2009)  
Target
Name:
5-hydroxytryptamine receptor 2A
Synonyms:
5-HT-2 5-HT2A 5-hydroxytryptamine receptor 2A (5HT-2A) 5HT2A_HUMAN HTR2A | Serotonin receptor 2A
Type:
undefined
Mol. Mass.:
52607.65
Organism:
Homo sapiens (Human)
Description:
P28223
Residue:
471
  
Inhibitor
Name:
BDBM50301476
Synonyms:
1-(4-(2-(1,4-oxazepan-4-yl)ethoxy)-3-(1-methyl-1H-pyrazol-5-yl)phenyl)-3-(4-chlorophenyl)urea | CHEMBL569509
Type:
Small organic molecule
Emp. Form.:
C24H28ClN5O3
Mol. Mass.:
469.964
SMILES:
Cn1nccc1-c1cc(NC(=O)Nc2ccc(Cl)cc2)ccc1OCCN1CCCOCC1
: