Target
5-hydroxytryptamine receptor 2A
Ligand
BDBM50301483
Substrate
Meas. Tech.
ChEMBL_600346 (CHEMBL1041064)
Ki
0.99±n/a nM
Citation
 Dosa, PIStrah-Pleynet, SJayakumar, HCasper, MDecaire, MXiong, YLehmann, JChoi, KElwell, KWong, AWebb, RRAdams, JWRamirez, JRichman, JGThomsen, WSemple, GTeegarden, BR Solubilized phenyl-pyrazole ureas as potent, selective 5-HT(2A) inverse-agonists and their application as antiplatelet agents. Bioorg Med Chem Lett 19:5486-9 (2009)  
Target
Name:
5-hydroxytryptamine receptor 2A
Synonyms:
5-HT-2 5-HT2A 5-hydroxytryptamine receptor 2A (5HT-2A) 5HT2A_HUMAN HTR2A | Serotonin receptor 2A
Type:
undefined
Mol. Mass.:
52607.65
Organism:
Homo sapiens (Human)
Description:
P28223
Residue:
471
  
Inhibitor
Name:
BDBM50301483
Synonyms:
1-(4-chlorophenyl)-3-(4-(2-(3-methoxyazetidin-1-yl)ethoxy)-3-(1-methyl-1H-pyrazol-5-yl)phenyl)urea | CHEMBL585140
Type:
Small organic molecule
Emp. Form.:
C23H26ClN5O3
Mol. Mass.:
455.937
SMILES:
COC1CN(CCOc2ccc(NC(=O)Nc3ccc(Cl)cc3)cc2-c2ccnn2C)C1
: