Target
5-hydroxytryptamine receptor 2C
Ligand
BDBM50301474
Substrate
Meas. Tech.
ChEMBL_600347 (CHEMBL1041065)
Ki
151±n/a nM
Citation
 Dosa, PIStrah-Pleynet, SJayakumar, HCasper, MDecaire, MXiong, YLehmann, JChoi, KElwell, KWong, AWebb, RRAdams, JWRamirez, JRichman, JGThomsen, WSemple, GTeegarden, BR Solubilized phenyl-pyrazole ureas as potent, selective 5-HT(2A) inverse-agonists and their application as antiplatelet agents. Bioorg Med Chem Lett 19:5486-9 (2009)  
Target
Name:
5-hydroxytryptamine receptor 2C
Synonyms:
5-HT-2C 5-HT2C-INI 5-HTR2C 5-hydroxytryptamine receptor 2C (5-HT-2C) 5HT-1C HTR1C Serotonin (5-HT3) receptor Serotonin Receptor 2C
Type:
G Protein-Coupled Receptor (GPCR)
Mol. Mass.:
51836.79
Organism:
Homo sapiens (Human)
Description:
P28335
Residue:
458
  
Inhibitor
Name:
BDBM50301474
Synonyms:
1-(4-chlorophenyl)-3-(3-(1-methyl-1H-pyrazol-5-yl)-4-(3-morpholinopropoxy)phenyl)urea | CHEMBL572134
Type:
Small organic molecule
Emp. Form.:
C24H28ClN5O3
Mol. Mass.:
469.964
SMILES:
Cn1nccc1-c1cc(NC(=O)Nc2ccc(Cl)cc2)ccc1OCCCN1CCOCC1
: