Target
Sodium channel protein type 9 subunit alpha
Ligand
BDBM50301553
Substrate
Meas. Tech.
ChEMBL_600508 (CHEMBL1048220)
IC50
960±n/a nM
Citation
 Shao, PPYe, FWeber, AELi, XLyons, KAParsons, WHGarcia, MLPriest, BTSmith, MMFelix, JPWilliams, BSKaczorowski, GJMcGowan, EAbbadie, CMartin, WJMcMasters, DRGao, YD Discovery of a novel class of isoxazoline voltage gated sodium channel blockers. Bioorg Med Chem Lett 19:5329-33 (2009)  
Target
Name:
Sodium channel protein type 9 subunit alpha
Synonyms:
NENA Peripheral sodium channel 1 SCN9A_HUMAN Voltage-gated sodium channel subunit Nav1.7 hNE-Na
Type:
Protein
Mol. Mass.:
226375.97
Organism:
Homo sapiens (Human)
Description:
Q15858
Residue:
1988
  
Inhibitor
Name:
BDBM50301553
Synonyms:
CHEMBL584716 | trans-2-(5-methyl-5-phenyl-4,5-dihydroisoxazol-3-yl)-N-(4-(trifluoromethoxy)benzyl)cyclopentanecarboxamide
Type:
Small organic molecule
Emp. Form.:
C24H25F3N2O3
Mol. Mass.:
446.4621
SMILES:
CC1(CC(=NO1)[C@@H]1CCC[C@H]1C(=O)NCc1ccc(OC(F)(F)F)cc1)c1ccccc1
: