Target
Sodium channel protein type 9 subunit alpha
Ligand
BDBM50301546
Substrate
Meas. Tech.
ChEMBL_600508 (CHEMBL1048220)
IC50
620±n/a nM
Citation
 Shao, PPYe, FWeber, AELi, XLyons, KAParsons, WHGarcia, MLPriest, BTSmith, MMFelix, JPWilliams, BSKaczorowski, GJMcGowan, EAbbadie, CMartin, WJMcMasters, DRGao, YD Discovery of a novel class of isoxazoline voltage gated sodium channel blockers. Bioorg Med Chem Lett 19:5329-33 (2009)  
Target
Name:
Sodium channel protein type 9 subunit alpha
Synonyms:
NENA Peripheral sodium channel 1 SCN9A_HUMAN Voltage-gated sodium channel subunit Nav1.7 hNE-Na
Type:
Protein
Mol. Mass.:
226375.97
Organism:
Homo sapiens (Human)
Description:
Q15858
Residue:
1988
  
Inhibitor
Name:
BDBM50301546
Synonyms:
CHEMBL568322 | trans-2-(5-phenyl-4,5-dihydrooxazol-2-yl)-N-(4-(trifluoromethoxy)benzyl)cyclopentanecarboxamide
Type:
Small organic molecule
Emp. Form.:
C23H23F3N2O3
Mol. Mass.:
432.4355
SMILES:
FC(F)(F)Oc1ccc(CNC(=O)[C@@H]2CCC[C@H]2C2=NCC(O2)c2ccccc2)cc1
: