Target
Tyrosine-protein kinase Lck
Ligand
BDBM50301581
Substrate
Meas. Tech.
ChEMBL_600521 (CHEMBL1049046)
IC50
242±n/a nM
Citation
 Hunt, JABeresis, RTGoulet, JLHolmes, MAHong, XJKovacs, EMills, SGRuzek, RDWong, FHermes, JDPark, YWSalowe, SPSonatore, LMWu, LWoods, AZaller, DMSinclair, PJ Disubstituted pyrimidines as Lck inhibitors. Bioorg Med Chem Lett 19:5440-3 (2009)  
Target
Name:
Tyrosine-protein kinase Lck
Synonyms:
2.7.10.2 LCK_HUMAN Leukocyte C-terminal Src kinase Lymphocyte-specific protein tyrosine kinase Protein YT16 Proto-oncogene tyrosine-protein kinase LCK T cell-specific protein-tyrosine kinase
Type:
Mol. Mass.:
57987.83
Organism:
Homo sapiens (Human)
Description:
P06239
Residue:
509
  
Inhibitor
Name:
BDBM50301581
Synonyms:
3-(1-(4-(1H-benzo[d]imidazol-1-yl)pyrimidin-2-ylamino)ethyl)-N-methylpiperidine-1-carboxamide | CHEMBL584044
Type:
Small organic molecule
Emp. Form.:
C20H25N7O
Mol. Mass.:
379.4588
SMILES:
CNC(=O)N1CCCC(C1)C(C)Nc1nccc(n1)-n1cnc2ccccc12
: