Target
Sodium channel protein type 9 subunit alpha
Ligand
BDBM50301724
Substrate
Meas. Tech.
ChEMBL_597903 (CHEMBL1042688)
IC50
220±n/a nM
Citation
 Shao, PPYe, FWeber, AELi, XLyons, KAParsons, WHGarcia, MLPriest, BTSmith, MMFelix, JPWilliams, BSKaczorowski, GJMcGowan, EAbbadie, CMartin, WJMcMasters, DRGao, YD Discovery of isoxazole voltage gated sodium channel blockers for treatment of chronic pain. Bioorg Med Chem Lett 19:5334-8 (2009)  
Target
Name:
Sodium channel protein type 9 subunit alpha
Synonyms:
NENA Peripheral sodium channel 1 SCN9A_HUMAN Voltage-gated sodium channel subunit Nav1.7 hNE-Na
Type:
Protein
Mol. Mass.:
226375.97
Organism:
Homo sapiens (Human)
Description:
Q15858
Residue:
1988
  
Inhibitor
Name:
BDBM50301724
Synonyms:
(1R,2R)-N-(1-phenylcyclopentyl)-2-(5-phenylisoxazol-3-yl)cyclopentanecarboxamide | CHEMBL565437
Type:
Small organic molecule
Emp. Form.:
C26H28N2O2
Mol. Mass.:
400.5127
SMILES:
O=C(NC1(CCCC1)c1ccccc1)[C@@H]1CCC[C@H]1c1cc(on1)-c1ccccc1
: