Target
Cannabinoid receptor 1
Ligand
BDBM50301736
Substrate
Meas. Tech.
ChEMBL_597913 (CHEMBL1042698)
Ki
19±n/a nM
Citation
 Dow, RLHadcock, JRScott, DOSchneider, SRPaight, ESIredale, PACarpino, PAGriffith, DAHammond, MDasilva-Jardine, P Bioisosteric replacement of the hydrazide pharmacophore of the cannabinoid-1 receptor antagonist SR141716A. Part I: potent, orally-active 1,4-disubstituted imidazoles. Bioorg Med Chem Lett 19:5351-4 (2009)  
Target
Name:
Cannabinoid receptor 1
Synonyms:
Brain-type cannabinoid receptor CB-R CNR1_RAT Cannabinoid receptor Cnr1 | Skr6
Type:
G Protein-Coupled Receptor (GPCR)
Mol. Mass.:
52856.55
Organism:
Rattus norvegicus (rat)
Description:
P20272
Residue:
473
  
Inhibitor
Name:
BDBM50301736
Synonyms:
(4-(5-(4-chlorophenyl)-1-(2,4-dichlorophenyl)-4-methyl-1H-pyrazol-3-yl)-1-isopropyl-1H-imidazol-5-yl)methanol | CHEMBL567811
Type:
Small organic molecule
Emp. Form.:
C23H21Cl3N4O
Mol. Mass.:
475.798
SMILES:
CC(C)n1cnc(c1CO)-c1nn(c(c1C)-c1ccc(Cl)cc1)-c1ccc(Cl)cc1Cl
: