Target
Metabotropic glutamate receptor 1
Ligand
BDBM50301821
Substrate
Meas. Tech.
ChEMBL_598101 (CHEMBL1038283)
IC50
3.3±n/a nM
Citation
 Ito, SHirata, YNagatomi, YSatoh, ASuzuki, GKimura, TSatow, AMaehara, SHikichi, HHata, MOhta, HKawamoto, H Discovery and biological profile of isoindolinone derivatives as novel metabotropic glutamate receptor 1 antagonists: a potential treatment for psychotic disorders. Bioorg Med Chem Lett 19:5310-3 (2009)  
Target
Name:
Metabotropic glutamate receptor 1
Synonyms:
GPRC1A GRM1_HUMAN Metabotropic Glutamate 1a | metabotropic glutamate 1
Type:
Enzyme
Mol. Mass.:
132358.19
Organism:
Homo sapiens (Human)
Description:
Q13255
Residue:
1194
  
Inhibitor
Name:
BDBM50301821
Synonyms:
2-ethyl-5-(1-(2-fluoropyridin-3-yl)-5-methyl-1H-1,2,3-triazol-4-yl)isoindolin-1-one | CHEMBL577833
Type:
Small organic molecule
Emp. Form.:
C18H16FN5O
Mol. Mass.:
337.3509
SMILES:
CCN1Cc2cc(ccc2C1=O)-c1nnn(c1C)-c1cccnc1F
: