Target
Genome polyprotein
Ligand
BDBM50301909
Substrate
Meas. Tech.
ChEMBL_598467 (CHEMBL1039991)
IC50
1200±n/a nM
Citation
 de Vicente, JHendricks, RTSmith, DBFell, JBFischer, JSpencer, SRStengel, PJMohr, PRobinson, JEBlake, JFHilgenkamp, RKYee, CZhao, JElworthy, TRTracy, JChin, ELi, JLui, AWang, BOshiro, CHarris, SFGhate, MLeveque, VJNajera, ILe Pogam, SRajyaguru, SAo-Ieong, GAlexandrova, LFitch, BBrandl, MMasjedizadeh, MWu, SYde Keczer, SVoronin, T Non-nucleoside inhibitors of HCV polymerase NS5B. Part 3: synthesis and optimization studies of benzothiazine-substituted tetramic acids. Bioorg Med Chem Lett 19:5648-51 (2009)  
Target
Name:
Genome polyprotein
Synonyms:
Genome polyprotein RNA polymerase (NS5B)
Type:
Enzyme
Mol. Mass.:
326966.11
Organism:
Hepatitis C virus (HCV)
Description:
Q9WMX2
Residue:
3010
  
Inhibitor
Name:
BDBM50301909
Synonyms:
3-[(S)-5-tert-Butyl-1-(4-fluoro-benzyl)-4-hydroxy-2-oxo-2,5-dihydro-1H-pyrrol-3-yl]-1,1-dioxo-1,4-dihydro-1lambda*6*-benzo[1,4]thiazine-7-carbonitrile | CHEMBL570260
Type:
Small organic molecule
Emp. Form.:
C24H22FN3O4S
Mol. Mass.:
467.513
SMILES:
CC(C)(C)[C@@H]1N(Cc2ccc(F)cc2)C(=O)C(C1=O)C1=Nc2ccc(cc2S(=O)(=O)C1)C#N
: