Target
Plasminogen
Ligand
BDBM50301979
Substrate
Meas. Tech.
ChEMBL_599101 (CHEMBL1047156)
IC50
8600±n/a nM
Citation
 West, CWAdler, MArnaiz, DChen, DChu, KGualtieri, GHo, EHuwe, CLight, DPhillips, GPulk, RSukovich, DWhitlow, MYuan, SBryant, J Identification of orally bioavailable, non-amidine inhibitors of Urokinase Plasminogen Activator (uPA). Bioorg Med Chem Lett 19:5712-5 (2009)  
Target
Name:
Plasminogen
Synonyms:
Activation peptide PLG Plasmin Plasmin heavy chain A, short form | Plasmin light chain B
Type:
Enzyme
Mol. Mass.:
90579.18
Organism:
Homo sapiens (Human)
Description:
Residue:
810
  
Inhibitor
Name:
BDBM50301979
Synonyms:
2-(6-(3'-(aminomethyl)biphenyl-3-yloxy)-3,5-difluoropyridin-2-yloxy)-3-methylbenzoic acid | CHEMBL571798
Type:
Small organic molecule
Emp. Form.:
C26H20F2N2O4
Mol. Mass.:
462.4448
SMILES:
Cc1cccc(C(O)=O)c1Oc1nc(Oc2cccc(c2)-c2cccc(CN)c2)c(F)cc1F
: