Target
Urokinase-type plasminogen activator
Ligand
BDBM50301993
Substrate
Meas. Tech.
ChEMBL_599341 (CHEMBL1042862)
IC50
26000±n/a nM
Citation
 West, CWAdler, MArnaiz, DChen, DChu, KGualtieri, GHo, EHuwe, CLight, DPhillips, GPulk, RSukovich, DWhitlow, MYuan, SBryant, J Identification of orally bioavailable, non-amidine inhibitors of Urokinase Plasminogen Activator (uPA). Bioorg Med Chem Lett 19:5712-5 (2009)  
Target
Name:
Urokinase-type plasminogen activator
Synonyms:
PLAU UROK_HUMAN Urokinase-type plasminogen activator (uPA) | Urokinase-type plasminogen activator/surface receptor
Type:
Enzyme
Mol. Mass.:
48528.62
Organism:
Homo sapiens (Human)
Description:
P00749
Residue:
431
  
Inhibitor
Name:
BDBM50301993
Synonyms:
2-(6-(3'-(aminomethyl)biphenyl-3-yloxy)-3,5-difluoropyridin-2-yloxy)-6-methylbenzoic acid | CHEMBL572226
Type:
Small organic molecule
Emp. Form.:
C26H20F2N2O4
Mol. Mass.:
462.4448
SMILES:
Cc1cccc(Oc2nc(Oc3cccc(c3)-c3cccc(CN)c3)c(F)cc2F)c1C(O)=O
: