Target
Genome polyprotein
Ligand
BDBM50302017
Substrate
Meas. Tech.
ChEMBL_599107 (CHEMBL1047162)
IC50
>100000±n/a nM
Citation
 Sidique, SShiryaev, SARatnikov, BIHerath, ASu, YStrongin, AYCosford, ND Structure-activity relationship and improved hydrolytic stability of pyrazole derivatives that are allosteric inhibitors of West Nile Virus NS2B-NS3 proteinase. Bioorg Med Chem Lett 19:5773-7 (2009)  
Target
Name:
Genome polyprotein
Synonyms:
POLG_WNV | polyprotein precursor
Type:
PROTEIN
Mol. Mass.:
380170.63
Organism:
West Nile virus
Description:
ChEMBL_1438217
Residue:
3430
  
Inhibitor
Name:
BDBM50302017
Synonyms:
1-(2,6-difluorophenyl)-2-(1-(4-methoxybenzyl)-3-methyl-1H-pyrazol-5-yl)ethanol | CHEMBL571970
Type:
Small organic molecule
Emp. Form.:
C20H20F2N2O2
Mol. Mass.:
358.3818
SMILES:
COc1ccc(Cn2nc(C)cc2CC(O)c2c(F)cccc2F)cc1
: