Target
Genome polyprotein
Ligand
BDBM50302029
Substrate
Meas. Tech.
ChEMBL_599107 (CHEMBL1047162)
IC50
9200±n/a nM
Citation
 Sidique, SShiryaev, SARatnikov, BIHerath, ASu, YStrongin, AYCosford, ND Structure-activity relationship and improved hydrolytic stability of pyrazole derivatives that are allosteric inhibitors of West Nile Virus NS2B-NS3 proteinase. Bioorg Med Chem Lett 19:5773-7 (2009)  
Target
Name:
Genome polyprotein
Synonyms:
POLG_WNV | polyprotein precursor
Type:
PROTEIN
Mol. Mass.:
380170.63
Organism:
West Nile virus
Description:
ChEMBL_1438217
Residue:
3430
  
Inhibitor
Name:
BDBM50302029
Synonyms:
CHEMBL584951 | N-(1-(4-methoxyphenylsulfonyl)-3-methyl-1H-pyrazol-5-yl)benzamide
Type:
Small organic molecule
Emp. Form.:
C18H17N3O4S
Mol. Mass.:
371.41
SMILES:
COc1ccc(cc1)S(=O)(=O)n1nc(C)cc1NC(=O)c1ccccc1
: