Target
Prostaglandin E synthase
Ligand
BDBM50302415
Substrate
Meas. Tech.
ChEMBL_597590 (CHEMBL1050553)
IC50
1±n/a nM
Citation
 Giroux, ABoulet, LBrideau, CChau, AClaveau, DCôté, BEthier, DFrenette, RGagnon, MGuay, JGuiral, SMancini, JMartins, EMassé, FMéthot, NRiendeau, DRubin, JXu, DYu, HDucharme, YFriesen, RW Discovery of disubstituted phenanthrene imidazoles as potent, selective and orally active mPGES-1 inhibitors. Bioorg Med Chem Lett 19:5837-41 (2009)  
Target
Name:
Prostaglandin E synthase
Synonyms:
MGST1L1 PGES PTGES Prostaglandin E synthase (PGES-1) Prostaglandin E synthase-1 (PGES-1) Prostaglandin E2 synthase-1 ( mPGES-1)
Type:
Protein
Mol. Mass.:
17112.22
Organism:
Homo sapiens (Human)
Description:
Residue:
152
  
Inhibitor
Name:
BDBM50302415
Synonyms:
2-(9-(2-(1H-pyrrol-1-yl)ethoxy)-6-chloro-1H-phenanthro[9,10-d]imidazol-2-yl)isophthalonitrile | CHEMBL585690
Type:
Small organic molecule
Emp. Form.:
C29H18ClN5O
Mol. Mass.:
487.939
SMILES:
Clc1ccc2c3nc([nH]c3c3ccc(OCCn4cccc4)cc3c2c1)-c1c(cccc1C#N)C#N
: