Target
Cannabinoid receptor 1
Ligand
BDBM50303013
Substrate
Meas. Tech.
ChEMBL_596964 (CHEMBL1038201)
IC50
4.14±n/a nM
Citation
 Lee, SHSeo, HJKim, MJKang, SYLee, SHAhn, KLee, MHan, HKKim, JLee, J Pentacycle derivatives as cannabinoid CB1 receptor ligands. Bioorg Med Chem Lett 19:6632-6 (2009)  
Target
Name:
Cannabinoid receptor 1
Synonyms:
Brain-type cannabinoid receptor CB-R CNR1_RAT Cannabinoid receptor Cnr1 | Skr6
Type:
G Protein-Coupled Receptor (GPCR)
Mol. Mass.:
52856.55
Organism:
Rattus norvegicus (rat)
Description:
P20272
Residue:
473
  
Inhibitor
Name:
BDBM50303013
Synonyms:
2-(5-(4-chlorophenyl)-1-(2,4-dichlorophenyl)-4-(5-methyl-1,3,4-thiadiazol-2-yl)-1H-pyrazol-3-yl)-5-(1-(trifluoromethyl)cyclopropyl)-1,3,4-oxadiazole | CHEMBL584533
Type:
Small organic molecule
Emp. Form.:
C24H14Cl3F3N6OS
Mol. Mass.:
597.827
SMILES:
Cc1nnc(s1)-c1c(nn(c1-c1ccc(Cl)cc1)-c1ccc(Cl)cc1Cl)-c1nnc(o1)C1(CC1)C(F)(F)F
: