Target
Tyrosine-protein kinase JAK2
Ligand
BDBM50303042
Substrate
Meas. Tech.
ChEMBL_597274 (CHEMBL1043451)
IC50
<3±n/a nM
Citation
 Ioannidis, SLamb, MLDavies, AMAlmeida, LSu, MBebernitz, GYe, MBell, KAlimzhanov, MZinda, M Discovery of pyrazol-3-ylamino pyrazines as novel JAK2 inhibitors. Bioorg Med Chem Lett 19:6524-8 (2009)  
Target
Name:
Tyrosine-protein kinase JAK2
Synonyms:
JAK-2 JAK2_HUMAN Janus kinase 2 (JAK2) | Janus kinase 2 (a protein tyrosine kinase)
Type:
Protein
Mol. Mass.:
130684.68
Organism:
Homo sapiens (Human)
Description:
O60674
Residue:
1132
  
Inhibitor
Name:
BDBM50303042
Synonyms:
(S)-3-(1-(5-fluoropyrimidin-2-yl)ethylamino)-6-methyl-5-(5-methyl-1H-pyrazol-3-ylamino)pyrazine-2-carbonitrile | CHEMBL569720
Type:
Small organic molecule
Emp. Form.:
C16H16FN9
Mol. Mass.:
353.3569
SMILES:
C[C@H](Nc1nc(Nc2cc(C)n[nH]2)c(C)nc1C#N)c1ncc(F)cn1
: