Target
Tyrosine-protein kinase JAK3
Ligand
BDBM50303053
Substrate
Meas. Tech.
ChEMBL_597276 (CHEMBL1043453)
IC50
11710±n/a nM
Citation
 Ioannidis, SLamb, MLDavies, AMAlmeida, LSu, MBebernitz, GYe, MBell, KAlimzhanov, MZinda, M Discovery of pyrazol-3-ylamino pyrazines as novel JAK2 inhibitors. Bioorg Med Chem Lett 19:6524-8 (2009)  
Target
Name:
Tyrosine-protein kinase JAK3
Synonyms:
JAK-3 JAK3_HUMAN Janus kinase 3 (JAK3) L-JAK | Leukocyte janus kinase
Type:
Protein
Mol. Mass.:
125111.08
Organism:
Homo sapiens (Human)
Description:
P52333
Residue:
1124
  
Inhibitor
Name:
BDBM50303053
Synonyms:
(S)-N2-(1-(5-fluoropyridin-2-yl)ethyl)-N6-(5-methyl-1H-pyrazol-3-yl)pyrazine-2,6-diamine | CHEMBL569738
Type:
Small organic molecule
Emp. Form.:
C15H16FN7
Mol. Mass.:
313.3328
SMILES:
C[C@H](Nc1cncc(Nc2cc(C)n[nH]2)n1)c1ccc(F)cn1
: