Target
M-phase inducer phosphatase 1
Ligand
BDBM50303173
Substrate
Meas. Tech.
ChEMBL_595102 (CHEMBL1047962)
IC50
3400±n/a nM
Citation
 Wu, SVossius, SRahmouni, SMiletic, AVVang, TVazquez-Rodriguez, JCerignoli, FArimura, YWilliams, SHayes, TMoutschen, MVasile, SPellecchia, MMustelin, TTautz, L Multidentate small-molecule inhibitors of vaccinia H1-related (VHR) phosphatase decrease proliferation of cervix cancer cells. J Med Chem 52:6716-23 (2009)  
Target
Name:
M-phase inducer phosphatase 1
Synonyms:
CDC25A Dual specificity phosphatase Cdc25A MPIP1_HUMAN | phosphatase Cdc25
Type:
Protein
Mol. Mass.:
59090.18
Organism:
Homo sapiens (Human)
Description:
P30304
Residue:
524
  
Inhibitor
Name:
BDBM50303173
Synonyms:
2-(5-((3-(4-(2-chlorobenzyloxy)phenyl)-1-phenyl-1H-pyrazol-4-yl)methylene)-4-oxo-2-thioxothiazolidin-3-yl)ethanesulfonic acid | CHEMBL567069
Type:
Small organic molecule
Emp. Form.:
C28H22ClN3O5S3
Mol. Mass.:
612.139
SMILES:
OS(=O)(=O)CCN1C(=S)S\C(=C/c2cn(nc2-c2ccc(OCc3ccccc3Cl)cc2)-c2ccccc2)C1=O
: