Target
Mitogen-activated protein kinase 14
Ligand
BDBM3085
Substrate
Meas. Tech.
ChEMBL_595122 (CHEMBL1050609)
IC50
140±n/a nM
Citation
 Antczak, CVeach, DRRamirez, CNMinchenko, MAShum, DCalder, PAFrattini, MGClarkson, BDjaballah, H Structure-activity relationships of 6-(2,6-dichlorophenyl)-8-methyl-2-(phenylamino)pyrido[2,3-d]pyrimidin-7-ones: toward selective Abl inhibitors. Bioorg Med Chem Lett 19:6872-6 (2009)  
Target
Name:
Mitogen-activated protein kinase 14
Synonyms:
CSAID-binding protein CSBP1 CSPB1 MAP kinase 14 MAP kinase p38 alpha MAPK14 MK14_HUMAN Mitogen-activated protein kinase p38 alpha Stress-activated protein kinase 2a | p38 MAP kinase alpha/beta
Type:
Serine/threonine-protein kinase
Mol. Mass.:
41286.76
Organism:
Homo sapiens (Human)
Description:
Q16539
Residue:
360
  
Inhibitor
Name:
BDBM3085
Synonyms:
6-(2,6-dichlorophenyl)-2-{[3-(hydroxymethyl)phenyl]amino}-8-methyl-7H,8H-pyrido[2,3-d]pyrimidin-7-one PD166326
Type:
Small organic molecule
Emp. Form.:
C21H16Cl2N4O2
Mol. Mass.:
427.283
SMILES:
Cn1c2nc(Nc3cccc(CO)c3)ncc2cc(-c2c(Cl)cccc2Cl)c1=O
: