Target
Tyrosine-protein kinase ABL1
Ligand
BDBM3085
Substrate
Meas. Tech.
ChEMBL_595121 (CHEMBL1050608)
IC50
2.8±n/a nM
Citation
 Antczak, CVeach, DRRamirez, CNMinchenko, MAShum, DCalder, PAFrattini, MGClarkson, BDjaballah, H Structure-activity relationships of 6-(2,6-dichlorophenyl)-8-methyl-2-(phenylamino)pyrido[2,3-d]pyrimidin-7-ones: toward selective Abl inhibitors. Bioorg Med Chem Lett 19:6872-6 (2009)  
Target
Name:
Tyrosine-protein kinase ABL1
Synonyms:
ABL ABL1_HUMAN JTK7 Proto-oncogene tyrosine-protein kinase ABL1 Tyrosine-protein kinase ABL V-abl Abelson murine leukemia viral oncogene homolog 1 p150 | tyrosine-protein kinase ABL1 isoform a
Type:
Enzyme
Mol. Mass.:
122897.30
Organism:
Homo sapiens (Human)
Description:
P00519
Residue:
1130
  
Inhibitor
Name:
BDBM3085
Synonyms:
6-(2,6-dichlorophenyl)-2-{[3-(hydroxymethyl)phenyl]amino}-8-methyl-7H,8H-pyrido[2,3-d]pyrimidin-7-one PD166326
Type:
Small organic molecule
Emp. Form.:
C21H16Cl2N4O2
Mol. Mass.:
427.283
SMILES:
Cn1c2nc(Nc3cccc(CO)c3)ncc2cc(-c2c(Cl)cccc2Cl)c1=O
: