Target
Sodium/glucose cotransporter 1
Ligand
BDBM20880
Substrate
Meas. Tech.
ChEMBL_595351 (CHEMBL1050644)
IC50
890±n/a nM
Citation
 Lv, BXu, BFeng, YPeng, KXu, GDu, JZhang, LZhang, WZhang, TZhu, LDing, HSheng, ZWelihinda, ASeed, BChen, Y Exploration of O-spiroketal C-arylglucosides as novel and selective renal sodium-dependent glucose co-transporter 2 (SGLT2) inhibitors. Bioorg Med Chem Lett 19:6877-81 (2009)  
Target
Name:
Sodium/glucose cotransporter 1
Synonyms:
High affinity sodium-glucose cotransporter Na(+)/glucose cotransporter 1 SGLT1 Sodium-dependent glucose cotransporter 1 (SGLT1) Sodium/glucose cotransporter 1 (SGLT1) | Solute carrier family 5 member 1
Type:
Protein
Mol. Mass.:
73503.78
Organism:
Homo sapiens (Human)
Description:
P13866
Residue:
664
  
Inhibitor
Name:
BDBM20880
Synonyms:
(2S,3R,4R,5S,6R)-2-{4-chloro-3-[(4-ethoxyphenyl)methyl]phenyl}-6-(hydroxymethyl)oxane-3,4,5-triol C-aryl glucoside, 6 Dapagliflozin
Type:
Small organic molecule
Emp. Form.:
C21H25ClO6
Mol. Mass.:
408.873
SMILES:
CCOc1ccc(Cc2cc(ccc2Cl)[C@@H]2O[C@H](CO)[C@@H](O)[C@H](O)[C@H]2O)cc1
: