Target
Collagenase 3
Ligand
BDBM50303319
Substrate
Meas. Tech.
ChEMBL_595727 (CHEMBL1045250)
Ki
24±n/a nM
Citation
 Jullien, NMakritis, AGeorgiadis, DBeau, FYiotakis, ADive, V Phosphinic tripeptides as dual angiotensin-converting enzyme C-domain and endothelin-converting enzyme-1 inhibitors. J Med Chem 53:208-20 (2010)  
Target
Name:
Collagenase 3
Synonyms:
MMP-13 MMP13_HUMAN Matrix metalloproteinase-13 (MMP-13) | Matrix metalloproteinase-13 (MMP13)
Type:
Enzyme
Mol. Mass.:
53808.06
Organism:
Homo sapiens (Human)
Description:
P45452
Residue:
471
  
Inhibitor
Name:
BDBM50303319
Synonyms:
(S)-2-[(S)-3-[((R)-1-Benzyloxycarbonylamino-2-phenyl-ethyl)-hydroxy-phosphinoyl]-2-(3-phenyl-isoxazol-5-ylmethyl)-propionylamino]-3-(4-hydroxy-phenyl)-propionic acid | CHEMBL570732
Type:
Small organic molecule
Emp. Form.:
C38H38N3O9P
Mol. Mass.:
711.6968
SMILES:
OC(=O)[C@H](Cc1ccc(O)cc1)NC(=O)[C@H](Cc1cc(no1)-c1ccccc1)CP(O)(=O)[C@H](Cc1ccccc1)NC(=O)OCc1ccccc1
: