Target
Cruzipain
Ligand
BDBM50303406
Substrate
Meas. Tech.
ChEMBL_595793 (CHEMBL1048800)
IC50
120000±n/a nM
Citation
 Jadhav, AFerreira, RSKlumpp, CMott, BTAustin, CPInglese, JThomas, CJMaloney, DJShoichet, BKSimeonov, A Quantitative analyses of aggregation, autofluorescence, and reactivity artifacts in a screen for inhibitors of a thiol protease. J Med Chem 53:37-51 (2010)  
Target
Name:
Cruzipain
Synonyms:
CYSP_TRYCR Cruzaine | Major cysteine proteinase
Type:
Protein
Mol. Mass.:
49831.41
Organism:
Trypanosoma cruzi
Description:
P25779
Residue:
467
  
Inhibitor
Name:
BDBM50303406
Synonyms:
2-(2-(4-methyl-4H-1,2,4-triazol-3-ylthio)acetamido)-5,6-dihydro-4H-cyclopenta[b]thiophene-3-carboxamide cid_2514971
Type:
Small organic molecule
Emp. Form.:
C13H15N5O2S2
Mol. Mass.:
337.421
SMILES:
Cn1cnnc1SCC(=O)Nc1sc2CCCc2c1C(N)=O
: