Target
Cruzipain
Ligand
BDBM50303417
Substrate
Meas. Tech.
ChEMBL_595795 (CHEMBL1048802)
IC50
4±n/a nM
Citation
 Mott, BTFerreira, RSSimeonov, AJadhav, AAng, KKLeister, WShen, MSilveira, JTDoyle, PSArkin, MRMcKerrow, JHInglese, JAustin, CPThomas, CJShoichet, BKMaloney, DJ Identification and optimization of inhibitors of Trypanosomal cysteine proteases: cruzain, rhodesain, and TbCatB. J Med Chem 53:52-60 (2010)  
Target
Name:
Cruzipain
Synonyms:
CYSP_TRYCR Cruzaine | Major cysteine proteinase
Type:
Protein
Mol. Mass.:
49831.41
Organism:
Trypanosoma cruzi
Description:
P25779
Residue:
467
  
Inhibitor
Name:
BDBM50303417
Synonyms:
4-(Cyclopentylamino)-6-(3,5-difluorophenylamino)-1,3,5-triazine-2-carbonitrile | CHEMBL568171
Type:
Small organic molecule
Emp. Form.:
C15H14F2N6
Mol. Mass.:
316.3087
SMILES:
Fc1cc(F)cc(Nc2nc(NC3CCCC3)nc(n2)C#N)c1
: