Target
Cruzipain
Ligand
BDBM50303422
Substrate
Meas. Tech.
ChEMBL_595795 (CHEMBL1048802)
IC50
0.3±n/a nM
Citation
 Mott, BTFerreira, RSSimeonov, AJadhav, AAng, KKLeister, WShen, MSilveira, JTDoyle, PSArkin, MRMcKerrow, JHInglese, JAustin, CPThomas, CJShoichet, BKMaloney, DJ Identification and optimization of inhibitors of Trypanosomal cysteine proteases: cruzain, rhodesain, and TbCatB. J Med Chem 53:52-60 (2010)  
Target
Name:
Cruzipain
Synonyms:
CYSP_TRYCR Cruzaine | Major cysteine proteinase
Type:
Protein
Mol. Mass.:
49831.41
Organism:
Trypanosoma cruzi
Description:
P25779
Residue:
467
  
Inhibitor
Name:
BDBM50303422
Synonyms:
6-(3-chlorophenylamino)-9-cyclopentyl-9H-purine-2-carbonitrile cid_44142124
Type:
Small organic molecule
Emp. Form.:
C17H15ClN6
Mol. Mass.:
338.794
SMILES:
Clc1cccc(Nc2nc(nc3n(cnc23)C2CCCC2)C#N)c1
: