Target
Caspase-5
Ligand
BDBM50303417
Substrate
Meas. Tech.
ChEMBL_595873 (CHEMBL1040857)
IC50
13489.63±n/a nM
Citation
 Mott, BTFerreira, RSSimeonov, AJadhav, AAng, KKLeister, WShen, MSilveira, JTDoyle, PSArkin, MRMcKerrow, JHInglese, JAustin, CPThomas, CJShoichet, BKMaloney, DJ Identification and optimization of inhibitors of Trypanosomal cysteine proteases: cruzain, rhodesain, and TbCatB. J Med Chem 53:52-60 (2010)  
Target
Name:
Caspase-5
Synonyms:
CASP-5 CASP5_HUMAN Caspase-5 subunit p10 ICE(rel)-III ICH3 Protease TY | TY protease
Type:
Enzyme
Mol. Mass.:
49760.80
Organism:
Homo sapiens (Human)
Description:
P51878
Residue:
434
  
Inhibitor
Name:
BDBM50303417
Synonyms:
4-(Cyclopentylamino)-6-(3,5-difluorophenylamino)-1,3,5-triazine-2-carbonitrile | CHEMBL568171
Type:
Small organic molecule
Emp. Form.:
C15H14F2N6
Mol. Mass.:
316.3087
SMILES:
Fc1cc(F)cc(Nc2nc(NC3CCCC3)nc(n2)C#N)c1
: