Target
Cathepsin D
Ligand
BDBM50303742
Substrate
Meas. Tech.
ChEMBL_597056 (CHEMBL1044551)
IC50
36600±n/a nM
Citation
 Malamas, MSErdei, JGunawan, ITurner, JHu, YWagner, EFan, KChopra, ROlland, ABard, JJacobsen, SMagolda, RLPangalos, MRobichaud, AJ Design and synthesis of 5,5'-disubstituted aminohydantoins as potent and selective human beta-secretase (BACE1) inhibitors. J Med Chem 53:1146-58 (2010)  
Target
Name:
Cathepsin D
Synonyms:
CATD_HUMAN CTSD Cathepsin D heavy chain Cathepsin D precursor
Type:
Enzyme
Mol. Mass.:
44551.72
Organism:
Homo sapiens (Human)
Description:
Human proCathepsin D (SwissProt accession number P07339) was expressed in Sf9 cells, purified, and autoactivated.
Residue:
412
  
Inhibitor
Name:
BDBM50303742
Synonyms:
5-Adamantan-1-yl-2-amino-5-(3,4-dimethoxy-phenyl)-3-methyl-3,5-dihydro-imidazol-4-one | CHEMBL567485
Type:
Small organic molecule
Emp. Form.:
C22H29N3O3
Mol. Mass.:
383.484
SMILES:
COc1ccc(cc1OC)C1(N=C(N)N(C)C1=O)C12CC3CC(CC(C3)C1)C2
: