Target
G-protein coupled estrogen receptor 1
Ligand
BDBM50303803
Substrate
Meas. Tech.
ChEMBL_594736 (CHEMBL1038026)
IC50
11±n/a nM
Citation
 Ramesh, CNayak, TKBurai, RDennis, MKHathaway, HJSklar, LAProssnitz, ERArterburn, JB Synthesis and characterization of iodinated tetrahydroquinolines targeting the G protein-coupled estrogen receptor GPR30. J Med Chem 53:1004-14 (2010)  
Target
Name:
G-protein coupled estrogen receptor 1
Synonyms:
CEPR DRY12 G-protein-coupled receptor (GPR30 ) GPER1 GPR30
Type:
PROTEIN
Mol. Mass.:
42259.21
Organism:
Homo sapiens (Human)
Description:
ChEMBL_982507
Residue:
375
  
Inhibitor
Name:
BDBM50303803
Synonyms:
1-((3aS,4R,9bR)-4-(6-bromobenzo[d][1,3]dioxol-5-yl)-3a,4,5,9b-tetrahydro-3H-cyclopenta[c]quinolin-8-yl)ethanone cid_3136849 | cid_5322399
Type:
Small organic molecule
Emp. Form.:
C21H18BrNO3
Mol. Mass.:
412.277
SMILES:
CC(=O)c1ccc2N[C@H]([C@H]3CC=C[C@H]3c2c1)c1cc2OCOc2cc1Br
: