Target
Fructose-1,6-bisphosphatase 1
Ligand
BDBM50303866
Substrate
Meas. Tech.
ChEMBL_595157 (CHEMBL1037322)
IC50
100±n/a nM
Citation
 Dang, QKasibhatla, SRXiao, WLiu, YDare, JTaplin, FReddy, KRScarlato, GRGibson, Tvan Poelje, PDPotter, SCErion, MD Fructose-1,6-bisphosphatase Inhibitors. 2. Design, synthesis, and structure-activity relationship of a series of phosphonic acid containing benzimidazoles that function as 5'-adenosinemonophosphate (AMP) mimics. J Med Chem 53:441-51 (2010)  
Target
Name:
Fructose-1,6-bisphosphatase 1
Synonyms:
D-fructose-1,6-bisphosphate 1-phosphohydrolase 1 FBP FBPase 1 Fructose-1,6-bisphosphatase 1 | Fructose-1,6-bisphosphatase 1 (FBPase)
Type:
Protein
Mol. Mass.:
36843.58
Organism:
Homo sapiens (Human)
Description:
Liver FBPase (P09467)
Residue:
338
  
Inhibitor
Name:
BDBM50303866
Synonyms:
4-Amino-5-fluoro-7-chloro-1-isobutyl-2-[5-(2-phosphono)furanyl]-benzimidazole | CHEMBL570796
Type:
Small organic molecule
Emp. Form.:
C15H16ClFN3O4P
Mol. Mass.:
387.73
SMILES:
CC(C)Cn1c(nc2c(N)c(F)cc(Cl)c12)-c1ccc(o1)P(O)(O)=O
: