Target
Fructose-1,6-bisphosphatase 1
Ligand
BDBM50303875
Substrate
Meas. Tech.
ChEMBL_595158 (CHEMBL1037323)
IC50
650±n/a nM
Citation
 Dang, QKasibhatla, SRXiao, WLiu, YDare, JTaplin, FReddy, KRScarlato, GRGibson, Tvan Poelje, PDPotter, SCErion, MD Fructose-1,6-bisphosphatase Inhibitors. 2. Design, synthesis, and structure-activity relationship of a series of phosphonic acid containing benzimidazoles that function as 5'-adenosinemonophosphate (AMP) mimics. J Med Chem 53:441-51 (2010)  
Target
Name:
Fructose-1,6-bisphosphatase 1
Synonyms:
F16P1_RAT Fbp1 | Fructose-1,6-bisphosphatase
Type:
PROTEIN
Mol. Mass.:
39605.40
Organism:
Rattus norvegicus
Description:
ChEMBL_595158
Residue:
363
  
Inhibitor
Name:
BDBM50303875
Synonyms:
4-Amino-5-fluoro-7-(n-propyl)-1-isobutyl-2-[5-(2-phosphono)-furanyl]benzimidazole | CHEMBL572055
Type:
Small organic molecule
Emp. Form.:
C18H23FN3O4P
Mol. Mass.:
395.3651
SMILES:
CCCc1cc(F)c(N)c2nc(-c3ccc(o3)P(O)(O)=O)n(CC(C)C)c12
: