Target
Sodium-dependent serotonin transporter
Ligand
BDBM50304047
Substrate
Meas. Tech.
ChEMBL_601510 (CHEMBL1044205)
Ki
20±n/a nM
Citation
 Nielsen, SPedersen, CMHansen, SGPetersen, MDSinning, SWiborg, OJensen, HHBols, M An extended study of dimeric phenyl tropanes. Bioorg Med Chem 17:4900-9 (2009)  
Target
Name:
Sodium-dependent serotonin transporter
Synonyms:
5-HT Transporter 5HTT SC6A4_HUMAN SLC6A4 Serotonin transporter (5HTT) Sodium-dependent serotonin transporter (SERT) | Solute carrier family 6 member 4
Type:
Multi-pass membrane protein
Mol. Mass.:
70322.51
Organism:
Homo sapiens (Human)
Description:
P31645
Residue:
630
  
Inhibitor
Name:
BDBM50304047
Synonyms:
1-[3beta-(4-Chlorophenyl)tropane-2beta-carbonyl-oxy]-5-[(1,2,3)triazol-1-yl]pentane | CHEMBL606809
Type:
Small organic molecule
Emp. Form.:
C22H29ClN4O2
Mol. Mass.:
416.944
SMILES:
CN1C2CCC1[C@H]([C@H](C2)c1ccc(Cl)cc1)C(=O)OCCCCCn1ccnn1
: