Target
Sodium-dependent noradrenaline transporter
Ligand
BDBM50304051
Substrate
Meas. Tech.
ChEMBL_601511 (CHEMBL1044206)
Ki
100±n/a nM
Citation
 Nielsen, SPedersen, CMHansen, SGPetersen, MDSinning, SWiborg, OJensen, HHBols, M An extended study of dimeric phenyl tropanes. Bioorg Med Chem 17:4900-9 (2009)  
Target
Name:
Sodium-dependent noradrenaline transporter
Synonyms:
Monoamine transporter NET Noradrenaline Transporter (NET) Norepinephrine transporter protein (NET) SLC6A2 Sodium-dependent noradrenaline transporter (NET) | Solute carrier family 6 member 2
Type:
Multi-pass membrane protein
Mol. Mass.:
69337.72
Organism:
Homo sapiens (Human)
Description:
P23975
Residue:
617
  
Inhibitor
Name:
BDBM50304051
Synonyms:
1-[3beta-(4-Chlorophenyl)tropane-2beta-carbonyl-amino]-2-[3beta-(4-chlorophenyl)tropane-2beta-carbonylaminomethylbenzene-4-yl]ethane | CHEMBL611961
Type:
Small organic molecule
Emp. Form.:
C39H46Cl2N4O2
Mol. Mass.:
673.714
SMILES:
CN1C2CCC1[C@@H]([C@H](C2)c1ccc(Cl)cc1)C(=O)NCCc1ccc(CNC(=O)[C@@H]2C3CCC(C[C@@H]2c2ccc(Cl)cc2)N3C)cc1
: