Target
Muscarinic acetylcholine receptor M1
Ligand
BDBM50304075
Substrate
Meas. Tech.
ChEMBL_601714 (CHEMBL1050449)
IC50
>10000±n/a nM
Citation
 Peng, YZhang, QArora, SKeenan, SMKortagere, SWannemacher, KMHowells, RDWelsh, WJ Novel delta opioid receptor agonists exhibit differential stimulation of signaling pathways. Bioorg Med Chem 17:6442-50 (2009)  
Target
Name:
Muscarinic acetylcholine receptor M1
Synonyms:
ACM1_HUMAN Cholinergic receptor, muscarinic 1 | Cholinergic, muscarinic M1
Type:
Protein
Mol. Mass.:
51442.54
Organism:
Homo sapiens (Human)
Description:
P11229
Residue:
460
  
Inhibitor
Name:
BDBM50304075
Synonyms:
3-(5-(4-tert-butylphenyl)-3-((dimethylamino)methyl)-1H-1,2,4-triazol-1-yl)phenol | CHEMBL595449
Type:
Small organic molecule
Emp. Form.:
C21H26N4O
Mol. Mass.:
350.4573
SMILES:
CN(C)Cc1nc(-c2ccc(cc2)C(C)(C)C)n(n1)-c1cccc(O)c1
: