Target
S-ribosylhomocysteine lyase
Ligand
BDBM50304168
Substrate
Meas. Tech.
ChEMBL_601072 (CHEMBL1071831)
Ki
700±n/a nM
Citation
 Wnuk, SFRobert, JSobczak, AJMeyers, BPMalladi, VLZhu, JGopishetty, BPei, D Inhibition of S-ribosylhomocysteinase (LuxS) by substrate analogues modified at the ribosyl C-3 position. Bioorg Med Chem 17:6699-706 (2009)  
Target
Name:
S-ribosylhomocysteine lyase
Synonyms:
LUXS_BACSU ytjB
Type:
PROTEIN
Mol. Mass.:
17709.00
Organism:
Bacillus subtilis
Description:
ChEMBL_764478
Residue:
157
  
Inhibitor
Name:
BDBM50304168
Synonyms:
(2S)-2-amino-4-(((2S,3S,4S)-3-fluoro-4,5-dihydroxytetrahydrofuran-2-yl)methylthio)butanoic acid | CHEMBL595659
Type:
Small organic molecule
Emp. Form.:
C9H16FNO5S
Mol. Mass.:
269.29
SMILES:
N[C@@H](CCSC[C@H]1OC(O)[C@H](O)[C@@H]1F)C(O)=O
: