Target
Vascular endothelial growth factor receptor 3
Ligand
BDBM50304196
Substrate
Meas. Tech.
ChEMBL_605393 (CHEMBL1073387)
EC50
>10000±n/a nM
Citation
 Tasler, SMüller, OWieber, THerz, TPegoraro, SSaeb, WLang, MKrauss, RTotzke, FZirrgiebel, UEhlert, JEKubbutat, MHSchächtele, C Substituted 2-arylbenzothiazoles as kinase inhibitors: hit-to-lead optimization. Bioorg Med Chem 17:6728-37 (2009)  
Target
Name:
Vascular endothelial growth factor receptor 3
Synonyms:
FLT-4 Fms-like tyrosine kinase 4 VEGFR-3 VGFR3_HUMAN Vascular endothelial growth factor receptor 3 (VEGFR-3) | Vascular endothelial growth factor receptor 3 (VEGFR3)
Type:
Protein
Mol. Mass.:
152749.58
Organism:
Homo sapiens (Human)
Description:
P35916-2
Residue:
1363
  
Inhibitor
Name:
BDBM50304196
Synonyms:
CHEMBL593860 | N-[4-(Benzo[d]thiazol-2''-yl)-3-hydroxyphenyl]-6'-methoxy-7'-[3-(4-methylpiperazin-1-yl)propoxy]quinazolin-4'-amine
Type:
Small organic molecule
Emp. Form.:
C31H34N6O3S
Mol. Mass.:
570.705
SMILES:
COc1cc2c(Nc3ccc(-c4nc5ccccc5s4)c(OC)c3)ncnc2cc1OCCCN1CCN(C)CC1
: