Target
Vascular endothelial growth factor receptor 3
Ligand
BDBM50304200
Substrate
Meas. Tech.
ChEMBL_605393 (CHEMBL1073387)
EC50
>10000±n/a nM
Citation
 Tasler, SMüller, OWieber, THerz, TPegoraro, SSaeb, WLang, MKrauss, RTotzke, FZirrgiebel, UEhlert, JEKubbutat, MHSchächtele, C Substituted 2-arylbenzothiazoles as kinase inhibitors: hit-to-lead optimization. Bioorg Med Chem 17:6728-37 (2009)  
Target
Name:
Vascular endothelial growth factor receptor 3
Synonyms:
FLT-4 Fms-like tyrosine kinase 4 VEGFR-3 VGFR3_HUMAN Vascular endothelial growth factor receptor 3 (VEGFR-3) | Vascular endothelial growth factor receptor 3 (VEGFR3)
Type:
Protein
Mol. Mass.:
152749.58
Organism:
Homo sapiens (Human)
Description:
P35916-2
Residue:
1363
  
Inhibitor
Name:
BDBM50304200
Synonyms:
CHEMBL596292 | N-[4-(6''-Chlorobenzo[d]thiazol-2''-yl)phenyl]-6'-methoxy-7'-[3-(4-methylpiperazin-1-yl)propoxy]quinazolin-4'-amine
Type:
Small organic molecule
Emp. Form.:
C30H31ClN6O2S
Mol. Mass.:
575.124
SMILES:
COc1cc2c(Nc3ccc(cc3)-c3nc4cc(Cl)ccc4s3)ncnc2cc1OCCCN1CCN(C)CC1
: