Target
Angiopoietin-1 receptor
Ligand
BDBM50304202
Substrate
Meas. Tech.
ChEMBL_605394 (CHEMBL1073388)
EC50
300±n/a nM
Citation
 Tasler, SMüller, OWieber, THerz, TPegoraro, SSaeb, WLang, MKrauss, RTotzke, FZirrgiebel, UEhlert, JEKubbutat, MHSchächtele, C Substituted 2-arylbenzothiazoles as kinase inhibitors: hit-to-lead optimization. Bioorg Med Chem 17:6728-37 (2009)  
Target
Name:
Angiopoietin-1 receptor
Synonyms:
TEK TIE2_HUMAN Tyrosine-protein kinase receptor (TIE-2) Tyrosine-protein kinase receptor TEK (p140 TEK) Tyrosine-protein kinase receptor TIE2/TEK VMCM1 p140 TEK
Type:
Enzyme
Mol. Mass.:
125835.70
Organism:
Homo sapiens (Human)
Description:
Q02763
Residue:
1124
  
Inhibitor
Name:
BDBM50304202
Synonyms:
CHEMBL604483 | N-Methyl-N-[4-(benzo[d]thiazol-2''-yl)-3-methoxyphenyl]-6'-methoxy-7'-[3-(4-methylpiperazin-1-yl)propoxy]quinazolin-4'-amine
Type:
Small organic molecule
Emp. Form.:
C30H30FN5O3S
Mol. Mass.:
559.654
SMILES:
COc1cc2c(Oc3ccc(cc3F)-c3nc4ccccc4s3)ncnc2cc1OCCCN1CCN(C)CC1
: