Target
Angiopoietin-1 receptor
Ligand
BDBM50304196
Substrate
Meas. Tech.
ChEMBL_605386 (CHEMBL1073380)
EC50
>10000±n/a nM
Citation
 Tasler, SMüller, OWieber, THerz, TPegoraro, SSaeb, WLang, MKrauss, RTotzke, FZirrgiebel, UEhlert, JEKubbutat, MHSchächtele, C Substituted 2-arylbenzothiazoles as kinase inhibitors: hit-to-lead optimization. Bioorg Med Chem 17:6728-37 (2009)  
Target
Name:
Angiopoietin-1 receptor
Synonyms:
TEK TIE2_HUMAN Tyrosine-protein kinase receptor (TIE-2) Tyrosine-protein kinase receptor TEK (p140 TEK) Tyrosine-protein kinase receptor TIE2/TEK VMCM1 p140 TEK
Type:
Enzyme
Mol. Mass.:
125835.70
Organism:
Homo sapiens (Human)
Description:
Q02763
Residue:
1124
  
Inhibitor
Name:
BDBM50304196
Synonyms:
CHEMBL593860 | N-[4-(Benzo[d]thiazol-2''-yl)-3-hydroxyphenyl]-6'-methoxy-7'-[3-(4-methylpiperazin-1-yl)propoxy]quinazolin-4'-amine
Type:
Small organic molecule
Emp. Form.:
C31H34N6O3S
Mol. Mass.:
570.705
SMILES:
COc1cc2c(Nc3ccc(-c4nc5ccccc5s4)c(OC)c3)ncnc2cc1OCCCN1CCN(C)CC1
: