Target
Acetylcholinesterase
Ligand
BDBM50304234
Substrate
Meas. Tech.
ChEMBL_605400 (CHEMBL1073394)
IC50
560±n/a nM
Citation
 Sheng, RLin, XZhang, JChol, KSHuang, WYang, BHe, QHu, Y Design, synthesis and evaluation of flavonoid derivatives as potent AChE inhibitors. Bioorg Med Chem 17:6692-8 (2009)  
Target
Name:
Acetylcholinesterase
Synonyms:
ACES_RAT Acetylcholinesterase and butyrylcholinesterase (AChE and BChE) Acetylcholinesterase, AChE | Ache
Type:
Enzyme
Mol. Mass.:
68193.62
Organism:
Rattus norvegicus (rat)
Description:
P37136
Residue:
614
  
Inhibitor
Name:
BDBM50304234
Synonyms:
3-{3-[(Diethylamino)-methyl]-phenyl}-6,7-dimethoxy-4H-chromen-4-one | CHEMBL594919
Type:
Small organic molecule
Emp. Form.:
C21H23NO4
Mol. Mass.:
353.4116
SMILES:
CCN(CC)c1cccc(c1)-c1coc2cc(OC)c(OC)cc2c1=O
: