Target
Acetylcholinesterase
Ligand
BDBM50304240
Substrate
Meas. Tech.
ChEMBL_605400 (CHEMBL1073394)
IC50
4670±n/a nM
Citation
 Sheng, RLin, XZhang, JChol, KSHuang, WYang, BHe, QHu, Y Design, synthesis and evaluation of flavonoid derivatives as potent AChE inhibitors. Bioorg Med Chem 17:6692-8 (2009)  
Target
Name:
Acetylcholinesterase
Synonyms:
ACES_RAT Acetylcholinesterase and butyrylcholinesterase (AChE and BChE) Acetylcholinesterase, AChE | Ache
Type:
Enzyme
Mol. Mass.:
68193.62
Organism:
Rattus norvegicus (rat)
Description:
P37136
Residue:
614
  
Inhibitor
Name:
BDBM50304240
Synonyms:
6,7-Dimethoxy-2-{4-[(ethylmethylamino)-methyl]-phenyl}-chroman-4-one | CHEMBL608096
Type:
Small organic molecule
Emp. Form.:
C20H23NO4
Mol. Mass.:
341.4009
SMILES:
CCN(C)c1ccc(cc1)C1CC(=O)c2cc(OC)c(OC)cc2O1
: