Target
Carboxylic ester hydrolase
Ligand
BDBM50304241
Substrate
Meas. Tech.
ChEMBL_605401 (CHEMBL1073395)
IC50
>100000±n/a nM
Citation
 Sheng, RLin, XZhang, JChol, KSHuang, WYang, BHe, QHu, Y Design, synthesis and evaluation of flavonoid derivatives as potent AChE inhibitors. Bioorg Med Chem 17:6692-8 (2009)  
Target
Name:
Carboxylic ester hydrolase
Synonyms:
Acetylcholinesterase and butyrylcholinesterase (AChE and BChE) Butyrylcholinesterase (BuChE) | butyrylcholinesterase precursor
Type:
Enzyme
Mol. Mass.:
67776.22
Organism:
Rattus norvegicus (rat)
Description:
Residue:
597
  
Inhibitor
Name:
BDBM50304241
Synonyms:
2-{4-[(Diethylamino)-methyl]-phenyl}-6,7-dimethoxychroman-4-one | CHEMBL595859
Type:
Small organic molecule
Emp. Form.:
C21H25NO4
Mol. Mass.:
355.4275
SMILES:
CCN(CC)c1ccc(cc1)C1CC(=O)c2cc(OC)c(OC)cc2O1
: