Target
Acetylcholinesterase
Ligand
BDBM50304245
Substrate
Meas. Tech.
ChEMBL_605400 (CHEMBL1073394)
IC50
4±n/a nM
Citation
 Sheng, RLin, XZhang, JChol, KSHuang, WYang, BHe, QHu, Y Design, synthesis and evaluation of flavonoid derivatives as potent AChE inhibitors. Bioorg Med Chem 17:6692-8 (2009)  
Target
Name:
Acetylcholinesterase
Synonyms:
ACES_RAT Acetylcholinesterase and butyrylcholinesterase (AChE and BChE) Acetylcholinesterase, AChE | Ache
Type:
Enzyme
Mol. Mass.:
68193.62
Organism:
Rattus norvegicus (rat)
Description:
P37136
Residue:
614
  
Inhibitor
Name:
BDBM50304245
Synonyms:
6,7-Dimethoxy-3-[4-(pyrrolidin-1-ylmethyl)-phenyl]-4H-chromen-4-one | CHEMBL594229
Type:
Small organic molecule
Emp. Form.:
C21H21NO4
Mol. Mass.:
351.3957
SMILES:
COc1cc2occ(-c3ccc(cc3)N3CCCC3)c(=O)c2cc1OC
: