Target
Acetylcholinesterase
Ligand
BDBM50304320
Substrate
Meas. Tech.
ChEMBL_606473 (CHEMBL1065424)
IC50
6.7±n/a nM
Citation
 Yan, JSun, LWu, GYi, PYang, FZhou, LZhang, XLi, ZYang, XLuo, HQiu, M Rational design and synthesis of highly potent anti-acetylcholinesterase activity huperzine A derivatives. Bioorg Med Chem 17:6937-41 (2009)  
Target
Name:
Acetylcholinesterase
Synonyms:
3.1.1.7 Acetylcholinesterase (AChE) ache
Type:
Mol. Mass.:
65900.74
Organism:
Tetronarce californica (Pacific electric ray) (Torpedo californica)
Description:
P04058
Residue:
586
  
Inhibitor
Name:
BDBM50304320
Synonyms:
(1R,9R)-13-Eth-(E)-ylidene-1-{[1-(4-hydroxy-3-methoxy-phenyl)-methylidene]-amino}-11-methyl-6-aza-tricyclo[7.3.1.0*2,7*]trideca-2(7),3,10-trien-5-one | CHEMBL604478
Type:
Small organic molecule
Emp. Form.:
C23H24N2O3
Mol. Mass.:
376.4483
SMILES:
COc1cc(\C=N\[C@@]23CC(C)=C[C@@H](Cc4[nH]c(=O)ccc24)\C3=C/C)ccc1O
: