Target
Acetylcholinesterase
Ligand
BDBM50304330
Substrate
Meas. Tech.
ChEMBL_606473 (CHEMBL1065424)
IC50
0.121±n/a nM
Citation
 Yan, JSun, LWu, GYi, PYang, FZhou, LZhang, XLi, ZYang, XLuo, HQiu, M Rational design and synthesis of highly potent anti-acetylcholinesterase activity huperzine A derivatives. Bioorg Med Chem 17:6937-41 (2009)  
Target
Name:
Acetylcholinesterase
Synonyms:
3.1.1.7 Acetylcholinesterase (AChE) ache
Type:
Mol. Mass.:
65900.74
Organism:
Tetronarce californica (Pacific electric ray) (Torpedo californica)
Description:
P04058
Residue:
586
  
Inhibitor
Name:
BDBM50304330
Synonyms:
(1R,9R)-1-[3-(4-Dimethylamino-phenyl)-prop-2-enylideneamino]-13-eth-(E)-ylidene-11-methyl-6-aza-tricyclo[7.3.1.0*2,7*]trideca-2(7),3,10-trien-5-one | CHEMBL606372
Type:
Small organic molecule
Emp. Form.:
C26H29N3O
Mol. Mass.:
399.528
SMILES:
C\C=C1/[C@@H]2Cc3[nH]c(=O)ccc3[C@]1(CC(C)=C2)\N=C\C=C\c1ccc(cc1)N(C)C
: