Target
Glycine receptor subunit alpha-1
Ligand
BDBM50415201
Substrate
Meas. Tech.
ChEMBL_606507 (CHEMBL1065458)
IC50
11220.18±n/a nM
Citation
 Maksay, GVincze, ZNemes, P Synthesis of heteroaromatic tropeines and heterogeneous binding to glycine receptors. Bioorg Med Chem 17:6872-8 (2009)  
Target
Name:
Glycine receptor subunit alpha-1
Synonyms:
GLRA1_RAT Glycine receptor alpha-1 chain Glycine, non-strychnine Glyr
Type:
Enzyme Catalytic Domain
Mol. Mass.:
52629.37
Organism:
RAT
Description:
Glycine, non-strychnine 0 RAT::P07727
Residue:
457
  
Inhibitor
Name:
BDBM50415201
Synonyms:
CHEMBL611364
Type:
Small organic molecule
Emp. Form.:
C13H18N2O2
Mol. Mass.:
234.2942
SMILES:
CN1[C@@H]2CC[C@@H]1CC(C2)OC(=O)c1ccc[nH]1
: